BDBM50449047 CHEMBL3126214::US9212144, 6 (Ex. 12)
SMILES: Nc1ccc2ccc(CCNCc3cccc(F)c3)cc2n1
InChI Key: InChIKey=GFTZBOUXJJDHLM-UHFFFAOYSA-N
Data: 6 KI
PDB links: 2 PDB IDs match this monomer.
Activity Spreadsheet -- Enzyme Inhibition Constant Data from BindingDB
Found 6 hits for monomerid = 50449047
Trg + Lig
Ki
nM
ΔG°
kcal/mole
IC50
nM
Kd
nM
EC50/IC50
nM
koff
s-1
kon
M-1s-1
pHTemp
°C
Nitric-oxide synthase, brain
(Rattus norvegicus (rat))
BDBM50449047
(CHEMBL3126214 | US9212144, 6 (Ex. 12))
Show SMILES Nc1ccc2ccc(CCNCc3cccc(F)c3)cc2n1
Show InChI InChI=1S/C18H18FN3/c19-16-3-1-2-14(10-16)12-21-9-8-13-4-5-15-6-7-18(20)22-17(15)11-13/h1-7,10-11,21H,8-9,12H2,(H2,20,22)
US Patent
254n/an/an/an/an/an/a7.4n/a
Northwestern University
US Patent
Assay Description
To test for enzyme inhibition, the hemoglobin capture assay was used to measure nitric oxide production. The assay was performed at 37° C. in HEPES b...
US Patent US9212144 (2015)
BindingDB Entry DOI: 10.7270/Q2K0732P
3D
3D Structure (crystal)
Nitric-oxide synthase, brain
(Rattus norvegicus (rat))
BDBM50449047
(CHEMBL3126214 | US9212144, 6 (Ex. 12))
Show SMILES Nc1ccc2ccc(CCNCc3cccc(F)c3)cc2n1
Show InChI InChI=1S/C18H18FN3/c19-16-3-1-2-14(10-16)12-21-9-8-13-4-5-15-6-7-18(20)22-17(15)11-13/h1-7,10-11,21H,8-9,12H2,(H2,20,22)
254n/an/an/an/an/an/an/an/a
Northwestern University
Curated by ChEMBL
Assay Description
Inhibition of rat recombinant nNOS expressed in Escherichia coli using L-arginine as substrate assessed as NO production by hemoglobin capture assay
J Med Chem 57: 1513-30 (2014)
Article DOI: 10.1021/jm401838x
BindingDB Entry DOI: 10.7270/Q2MP54SZ
3D
3D Structure (crystal)
Nitric Oxide Synthase, endothelial
(Bos taurus (bovine))
BDBM50449047
(CHEMBL3126214 | US9212144, 6 (Ex. 12))
Show SMILES Nc1ccc2ccc(CCNCc3cccc(F)c3)cc2n1
Show InChI InChI=1S/C18H18FN3/c19-16-3-1-2-14(10-16)12-21-9-8-13-4-5-15-6-7-18(20)22-17(15)11-13/h1-7,10-11,21H,8-9,12H2,(H2,20,22)
7.77E+3n/an/an/an/an/an/an/an/a
Northwestern University
Curated by ChEMBL
Assay Description
Inhibition of bovine recombinant eNOS expressed in Escherichia coli using L-arginine as substrate assessed as NO production by hemoglobin capture ass...
J Med Chem 57: 1513-30 (2014)
Article DOI: 10.1021/jm401838x
BindingDB Entry DOI: 10.7270/Q2MP54SZ
Nitric Oxide Synthase, endothelial
(Bos taurus (bovine))
BDBM50449047
(CHEMBL3126214 | US9212144, 6 (Ex. 12))
Show SMILES Nc1ccc2ccc(CCNCc3cccc(F)c3)cc2n1
Show InChI InChI=1S/C18H18FN3/c19-16-3-1-2-14(10-16)12-21-9-8-13-4-5-15-6-7-18(20)22-17(15)11-13/h1-7,10-11,21H,8-9,12H2,(H2,20,22)
US Patent
7.77E+3n/an/an/an/an/an/a7.4n/a
Northwestern University
US Patent
Assay Description
To test for enzyme inhibition, the hemoglobin capture assay was used to measure nitric oxide production. The assay was performed at 37° C. in HEPES b...
US Patent US9212144 (2015)
BindingDB Entry DOI: 10.7270/Q2K0732P
Nitric Oxide Synthase, inducible
(Mus musculus (mouse))
BDBM50449047
(CHEMBL3126214 | US9212144, 6 (Ex. 12))
Show SMILES Nc1ccc2ccc(CCNCc3cccc(F)c3)cc2n1
Show InChI InChI=1S/C18H18FN3/c19-16-3-1-2-14(10-16)12-21-9-8-13-4-5-15-6-7-18(20)22-17(15)11-13/h1-7,10-11,21H,8-9,12H2,(H2,20,22)
Reactome pathway
2.45E+4n/an/an/an/an/an/an/an/a
Northwestern University
Curated by ChEMBL
Assay Description
Inhibition of mouse recombinant iNOS expressed in Escherichia coli using L-arginine as substrate assessed as NO production by hemoglobin capture assa...
J Med Chem 57: 1513-30 (2014)
Article DOI: 10.1021/jm401838x
BindingDB Entry DOI: 10.7270/Q2MP54SZ
Nitric Oxide Synthase, inducible
(Mus musculus (mouse))
BDBM50449047
(CHEMBL3126214 | US9212144, 6 (Ex. 12))
Show SMILES Nc1ccc2ccc(CCNCc3cccc(F)c3)cc2n1
Show InChI InChI=1S/C18H18FN3/c19-16-3-1-2-14(10-16)12-21-9-8-13-4-5-15-6-7-18(20)22-17(15)11-13/h1-7,10-11,21H,8-9,12H2,(H2,20,22)
Reactome pathway
US Patent
2.45E+4n/an/an/an/an/an/a7.4n/a
Northwestern University
US Patent
Assay Description
To test for enzyme inhibition, the hemoglobin capture assay was used to measure nitric oxide production. The assay was performed at 37° C. in HEPES b...
US Patent US9212144 (2015)
BindingDB Entry DOI: 10.7270/Q2K0732P