null
SMILES: O=C(OCC1CCCN(CCCc2ccccc2)C1)c1ccccc1N1C(=O)CC(Cc2ccccc2)C1=O
InChI Key: InChIKey=UCTGXUBCYYWFLY-UHFFFAOYSA-N
Activity Spreadsheet -- Enzyme Inhibition Constant Data from BindingDB
Found 1 hit for monomerid = 50451974
Trg + Lig
Ki
nM
ΔG°
kcal/mole
IC50
nM
Kd
nM
EC50/IC50
nM
koff
s-1
kon
M-1s-1
pHTemp
°C
Neuronal acetylcholine receptor subunit alpha-3/beta-4
(Homo sapiens (Human))
BDBM50451974
(CHEMBL340342)
Show SMILES O=C(OCC1CCCN(CCCc2ccccc2)C1)c1ccccc1N1C(=O)CC(Cc2ccccc2)C1=O
Show InChI InChI=1S/C33H36N2O4/c36-31-22-28(21-26-13-5-2-6-14-26)32(37)35(31)30-18-8-7-17-29(30)33(38)39-24-27-16-10-20-34(23-27)19-9-15-25-11-3-1-4-12-25/h1-8,11-14,17-18,27-28H,9-10,15-16,19-24H2
n/an/a 1.30E+3n/an/an/an/an/an/a
Ohio University
Curated by ChEMBL
Assay Description
Effect on alpha3-beta4 neuronal nicotinic acetylcholine receptor-stimulated adrenal catecholamine secretion
Bioorg Med Chem Lett 14: 3739-42 (2004)
Article DOI: 10.1016/j.bmcl.2004.05.001
BindingDB Entry DOI: 10.7270/Q28G8M80