null
SMILES:
InChI Key:
Activity Spreadsheet -- Enzyme Inhibition Constant Data from BindingDB
Found 4 hits for monomerid = 50604134
Trg + Lig
Ki
nM
ΔG°
kcal/mole
IC50
nM
Kd
nM
EC50/IC50
nM
koff
s-1
kon
M-1s-1
pHTemp
°C
AP2-associated protein kinase 1
(Mus musculus)
CHEMBL5187778
Reactome pathway
0.0900n/an/an/an/an/an/an/an/a
TBA
Citation and Details
Cytochrome P450 3A4
(Homo sapiens (Human))
CHEMBL5187778
Reactome pathway
n/an/a 740n/an/an/an/an/an/a
TBA
Citation and Details
AP2-associated protein kinase 1
(Homo sapiens (Human))
CHEMBL5187778
n/an/a 1.40n/an/an/an/an/an/a
TBA
Citation and Details
AP2-associated protein kinase 1
(Homo sapiens (Human))
CHEMBL5187778
n/an/a 0.5n/an/an/an/an/an/a
TBA
Citation and Details