null
SMILES:
InChI Key:
Activity Spreadsheet -- Enzyme Inhibition Constant Data from BindingDB
Found 11 hits for monomerid = 50604141
Trg + Lig
Ki
nM
ΔG°
kcal/mole
IC50
nM
Kd
nM
EC50/IC50
nM
koff
s-1
kon
M-1s-1
pHTemp
°C
AP2-associated protein kinase 1
(Mus musculus)
CHEMBL5188433
Reactome pathway
0.110n/an/an/an/an/an/an/an/a
TBA
Citation and Details
AP2-associated protein kinase 1
(Homo sapiens (Human))
CHEMBL5188433
n/an/a 4.20n/an/an/an/an/an/a
TBA
Citation and Details
Cytochrome P450 3A4
(Homo sapiens (Human))
CHEMBL5188433
Reactome pathway
n/an/a>2.00E+4n/an/an/an/an/an/a
TBA
Citation and Details
BMP-2-inducible protein kinase
(Homo sapiens (Human))
CHEMBL5188433
n/an/a 6n/an/an/an/an/an/a
TBA
Citation and Details
Dual specificity mitogen-activated protein kinase kinase 1
(Homo sapiens (Human))
CHEMBL5188433
Reactome pathway
n/an/a 1.86E+3n/an/an/an/an/an/a
TBA
Citation and Details
Rho-associated protein kinase 2
(Homo sapiens (Human))
CHEMBL5188433
n/an/a 1.10E+3n/an/an/an/an/an/a
TBA
Citation and Details
Dual specificity protein kinase CLK4
(Homo sapiens (Human))
CHEMBL5188433
n/an/a 740n/an/an/an/an/an/a
TBA
Citation and Details
Nuclear receptor subfamily 2 group C member 2
(Homo sapiens (Human))
CHEMBL5188433
Reactome pathway
n/an/a 120n/an/an/an/an/an/a
TBA
Citation and Details
Dual specificity mitogen-activated protein kinase kinase 1
(Homo sapiens (Human))
CHEMBL5188433
Reactome pathway
n/an/a 1.80E+3n/an/an/an/an/an/a
TBA
Citation and Details
AP2-associated protein kinase 1
(Homo sapiens (Human))
CHEMBL5188433
n/an/a 0.400n/an/an/an/an/an/a
TBA
Citation and Details
Homeodomain-interacting protein kinase 4
(Homo sapiens (Human))
CHEMBL5188433
n/an/a 1.30E+3n/an/an/an/an/an/a
TBA
Citation and Details