BDBM51162 4-chloranyl-1-methyl-N-(6-nitro-1,3-benzothiazol-2-yl)pyrazole-3-carboxamide::4-chloro-1-methyl-N-(6-nitro-1,3-benzothiazol-2-yl)-3-pyrazolecarboxamide::4-chloro-1-methyl-N-(6-nitro-1,3-benzothiazol-2-yl)pyrazole-3-carboxamide::4-chloro-N-{6-nitro-1,3-benzothiazol-2-yl}-1-methyl-1H-pyrazole-3-carboxamide::MLS000706089::SMR000227544::cid_741250
SMILES: Cn1cc(Cl)c(n1)C(=O)Nc1nc2ccc(cc2s1)[N+]([O-])=O
InChI Key: InChIKey=DUWOQGLZJFBHPW-UHFFFAOYSA-N
Data: 2 IC50
Activity Spreadsheet -- Enzyme Inhibition Constant Data from BindingDB
Found 2 hits for monomerid = 51162
Trg + Lig
Ki
nM
ΔG°
kcal/mole
IC50
nM
Kd
nM
EC50/IC50
nM
koff
s-1
kon
M-1s-1
pHTemp
°C
Voltage-gated calcium channel subunit alpha Cav2.2
(Homo sapiens (Human))
BDBM51162
(4-chloranyl-1-methyl-N-(6-nitro-1,3-benzothiazol-2...)
Show SMILES Cn1cc(Cl)c(n1)C(=O)Nc1nc2ccc(cc2s1)[N+]([O-])=O
Show InChI InChI=1S/C12H8ClN5O3S/c1-17-5-7(13)10(16-17)11(19)15-12-14-8-3-2-6(18(20)21)4-9(8)22-12/h2-5H,1H3,(H,14,15,19)
PCBioAssay
n/an/a 5.21E+3n/an/an/an/an/an/a
Burnham Center for Chemical Genomics
Curated by PubChem BioAssay
Assay Description
Data Source: Data Source: Sanford-Burnham Center for Chemical Genomics (SBCCG) Source Affiliation: Sanford-Burnham Medical Research Institute Network...
PubChem Bioassay (2009)
BindingDB Entry DOI: 10.7270/Q2PZ578V
BZLF2
(Human herpesvirus 4 type 2)
BDBM51162
(4-chloranyl-1-methyl-N-(6-nitro-1,3-benzothiazol-2...)
Show SMILES Cn1cc(Cl)c(n1)C(=O)Nc1nc2ccc(cc2s1)[N+]([O-])=O
Show InChI InChI=1S/C12H8ClN5O3S/c1-17-5-7(13)10(16-17)11(19)15-12-14-8-3-2-6(18(20)21)4-9(8)22-12/h2-5H,1H3,(H,14,15,19)
PCBioAssay
n/an/a 3.73E+3n/an/an/an/an/an/a
Emory University Molecular Libraries Screening Center
Curated by PubChem BioAssay
Assay Description
NIH Molecular Libraries Screening Centers Network [MLSCN] Emory Chemical Biology Discovery Center in MLSCN Assay provider: Theodore Jardetzky; Northw...
PubChem Bioassay (2008)
BindingDB Entry DOI: 10.7270/Q2057DCW