BDBM52680 (2Z)-7-[(4-ethyl-1-piperazinyl)methyl]-6-hydroxy-2-[(4-methylphenyl)methylidene]-3-benzofuranone::(2Z)-7-[(4-ethylpiperazin-1-yl)methyl]-2-[(4-methylphenyl)methylidene]-6-oxidanyl-1-benzofuran-3-one::(2Z)-7-[(4-ethylpiperazin-1-yl)methyl]-6-hydroxy-2-[(4-methylphenyl)methylidene]-1-benzofuran-3-one::(2Z)-7-[(4-ethylpiperazino)methyl]-6-hydroxy-2-(4-methylbenzylidene)coumaran-3-one::MLS000685924::SMR000324787::cid_7243309
SMILES: CCN1CCN(Cc2c3O\C(=C/c4ccc(C)cc4)C(=O)c3ccc2O)CC1
InChI Key: InChIKey=QKOSUWUCBDBFTG-STZFKDTASA-N
Data: 3 EC50
Activity Spreadsheet -- Enzyme Inhibition Constant Data from BindingDB
Found 3 hits for monomerid = 52680
Trg + Lig
Ki
nM
ΔG°
kcal/mole
IC50
nM
Kd
nM
EC50/IC50
nM
koff
s-1
kon
M-1s-1
pHTemp
°C
POsterior Segregation family member (pos-1)
(Caenorhabditis elegans)
BDBM52680
((2Z)-7-[(4-ethyl-1-piperazinyl)methyl]-6-hydroxy-2...)
Show SMILES CCN1CCN(Cc2c3O\C(=C/c4ccc(C)cc4)C(=O)c3ccc2O)CC1
Show InChI InChI=1S/C23H26N2O3/c1-3-24-10-12-25(13-11-24)15-19-20(26)9-8-18-22(27)21(28-23(18)19)14-17-6-4-16(2)5-7-17/h4-9,14,26H,3,10-13,15H2,1-2H3/b21-14-
PCBioAssay
n/an/an/an/a 3.89E+4n/an/an/an/a
Broad Institute
Curated by PubChem BioAssay
Assay Description
Broad Institute: MLPCN maternal gene expression Project ID: 2024 Keywords: Zinc finger, C. elegans, maternal gene expression, RNA-protein interac...
PubChem Bioassay (2009)
BindingDB Entry DOI: 10.7270/Q28G8J4C
Kallikrein 7
(Homo sapiens (Human))
BDBM52680
((2Z)-7-[(4-ethyl-1-piperazinyl)methyl]-6-hydroxy-2...)
Show SMILES CCN1CCN(Cc2c3O\C(=C/c4ccc(C)cc4)C(=O)c3ccc2O)CC1
Show InChI InChI=1S/C23H26N2O3/c1-3-24-10-12-25(13-11-24)15-19-20(26)9-8-18-22(27)21(28-23(18)19)14-17-6-4-16(2)5-7-17/h4-9,14,26H,3,10-13,15H2,1-2H3/b21-14-
Reactome pathway
PCBioAssay
n/an/an/an/a 2.39E+4n/an/an/an/a
The Scripps Research Institute Molecular Screening Center
Curated by PubChem BioAssay
PubChem Bioassay (2013)
BindingDB Entry DOI: 10.7270/Q29G5KF0
RecName: Full=Zinc finger protein mex-5
(Caenorhabditis elegans)
BDBM52680
((2Z)-7-[(4-ethyl-1-piperazinyl)methyl]-6-hydroxy-2...)
Show SMILES CCN1CCN(Cc2c3O\C(=C/c4ccc(C)cc4)C(=O)c3ccc2O)CC1
Show InChI InChI=1S/C23H26N2O3/c1-3-24-10-12-25(13-11-24)15-19-20(26)9-8-18-22(27)21(28-23(18)19)14-17-6-4-16(2)5-7-17/h4-9,14,26H,3,10-13,15H2,1-2H3/b21-14-
PCBioAssay
n/an/an/an/a 1.11E+5n/an/an/an/a
Broad Institute
Curated by PubChem BioAssay
Assay Description
Broad Institute: MLPCN maternal gene expression Project ID: 2024 Keywords: Zinc finger, C. elegans, maternal gene expression, RNA-protein interac...
PubChem Bioassay (2009)
BindingDB Entry DOI: 10.7270/Q2D798VP