BDBM5564 6-(cyclohexylmethoxy)-9H-purine::NU2017::O6-cyclohexylmethylpurine
SMILES: C(Oc1ncnc2nc[nH]c12)C1CCCCC1
InChI Key: InChIKey=ZJSUFVUNHNCHCI-UHFFFAOYSA-N
Data: 2 IC50
PDB links: 11 PDB IDs contain this monomer as substructures. 11 PDB IDs contain inhibitors having a similarity of 90% to this monomer.
Activity Spreadsheet -- Enzyme Inhibition Constant Data from BindingDB
Found 2 hits for monomerid = 5564
Trg + Lig
Ki
nM
ΔG°
kcal/mole
IC50
nM
Kd
nM
EC50/IC50
nM
koff
s-1
kon
M-1s-1
pHTemp
°C
Cyclin-Dependent Kinase 2 (CDK2)
(Homo sapiens (Human))
BDBM5564
(6-(cyclohexylmethoxy)-9H-purine | NU2017 | O6-cycl...)
Show SMILES C(Oc1ncnc2nc[nH]c12)C1CCCCC1
Show InChI InChI=1S/C12H16N4O/c1-2-4-9(5-3-1)6-17-12-10-11(14-7-13-10)15-8-16-12/h7-9H,1-6H2,(H,13,14,15,16)
NCI pathway
Reactome pathway
n/an/a 1.30E+4n/an/an/an/a7.530
University of Newcastle
Assay Description
The enzyme was assayed with substrate histone H1 in the presence of 12.5 uM ATP/[gamma-32P] ATP. IC50 is the inhibitor concentration, which inhibits ...
J Med Chem 43: 2797-804 (2000)
Article DOI: 10.1021/jm990628o
BindingDB Entry DOI: 10.7270/Q20R9MKP
Cyclin-Dependent Kinase 1 (CDK1)
(Marthasterias glacialis (starfish))
BDBM5564
(6-(cyclohexylmethoxy)-9H-purine | NU2017 | O6-cycl...)
Show SMILES C(Oc1ncnc2nc[nH]c12)C1CCCCC1
Show InChI InChI=1S/C12H16N4O/c1-2-4-9(5-3-1)6-17-12-10-11(14-7-13-10)15-8-16-12/h7-9H,1-6H2,(H,13,14,15,16)
n/an/a 1.80E+4n/an/an/an/a7.530
University of Newcastle
Assay Description
The enzyme was assayed with substrate histone H1 in the presence of 12.5 uM ATP/[gamma-32P] ATP. IC50 is the inhibitor concentration, which inhibits ...
J Med Chem 43: 2797-804 (2000)
Article DOI: 10.1021/jm990628o
BindingDB Entry DOI: 10.7270/Q20R9MKP