null
SMILES: NC(=O)c1cnc2ccccc2c1
InChI Key: InChIKey=BLTDCIWCFCUQCB-UHFFFAOYSA-N
Activity Spreadsheet -- Enzyme Inhibition Constant Data from BindingDB
Found 1 hit for monomerid = 60924
Trg + Lig
Ki
nM
ΔG°
kcal/mole
IC50
nM
Kd
nM
EC50/IC50
nM
koff
s-1
kon
M-1s-1
pHTemp
°C
Nicotinamide N-methyltransferase
(Homo sapiens (Human))
BDBM60924
(quinoline 3-carboxamide)
Show SMILES NC(=O)c1cnc2ccccc2c1
Show InChI InChI=1S/C10H8N2O/c11-10(13)8-5-7-3-1-2-4-9(7)12-6-8/h1-6H,(H2,11,13)
9.70E+7 -1.44n/an/an/an/an/a8.637
Utrecht University
Assay Description
Enzyme activity assays were performed as previously described with NNMT (16.25 ug/mL, 550 nM) in 50 mM Tris buffer (pH 8.6) containing 1 mM DTT (all ...
Biochemistry 55: 5307-15 (2016)
Article DOI: 10.1021/acs.biochem.6b00733
BindingDB Entry DOI: 10.7270/Q2H130TH