BDBM61764 MLS001162637::N-(1,1-diketo-2,3-dihydrothiophen-3-yl)-3-[(5Z)-5-(2-fluorobenzylidene)-4-keto-2-thioxo-thiazolidin-3-yl]propionamide::N-(1,1-dioxo-2,3-dihydrothiophen-3-yl)-3-[(5Z)-5-[(2-fluorophenyl)methylidene]-4-oxo-2-sulfanylidene-1,3-thiazolidin-3-yl]propanamide::N-(1,1-dioxo-2,3-dihydrothiophen-3-yl)-3-[(5Z)-5-[(2-fluorophenyl)methylidene]-4-oxo-2-sulfanylidene-3-thiazolidinyl]propanamide::N-[1,1-bis(oxidanylidene)-2,3-dihydrothiophen-3-yl]-3-[(5Z)-5-[(2-fluorophenyl)methylidene]-4-oxidanylidene-2-sulfanylidene-1,3-thiazolidin-3-yl]propanamide::SMR000652856::cid_6236834
SMILES: Fc1ccccc1\C=C1/SC(=S)N(CCC(=O)NC2CS(=O)(=O)C=C2)C1=O
InChI Key: InChIKey=PTZHZNWJDHENMP-ZROIWOOFSA-N
Data: 1 IC50
Activity Spreadsheet -- Enzyme Inhibition Constant Data from BindingDB
Found 1 hit for monomerid = 61764
Trg + Lig
Ki
nM
ΔG°
kcal/mole
IC50
nM
Kd
nM
EC50/IC50
nM
koff
s-1
kon
M-1s-1
pHTemp
°C
Voltage-gated calcium channel subunit alpha Cav2.2
(Homo sapiens (Human))
BDBM61764
(MLS001162637 | N-(1,1-diketo-2,3-dihydrothiophen-3...)
Show SMILES Fc1ccccc1\C=C1/SC(=S)N(CCC(=O)NC2CS(=O)(=O)C=C2)C1=O |c:24|
Show InChI InChI=1S/C17H15FN2O4S3/c18-13-4-2-1-3-11(13)9-14-16(22)20(17(25)26-14)7-5-15(21)19-12-6-8-27(23,24)10-12/h1-4,6,8-9,12H,5,7,10H2,(H,19,21)/b14-9-
PCBioAssay
n/an/a 2.87E+3n/an/an/an/an/an/a
Burnham Center for Chemical Genomics
Curated by PubChem BioAssay
Assay Description
Data Source: Data Source: Sanford-Burnham Center for Chemical Genomics (SBCCG) Source Affiliation: Sanford-Burnham Medical Research Institute Network...
PubChem Bioassay (2009)
BindingDB Entry DOI: 10.7270/Q2PZ578V