null
SMILES:
InChI Key:
Activity Spreadsheet -- Enzyme Inhibition Constant Data from BindingDB
Found 2 hits for monomerid = 643179
Trg + Lig
Ki
nM
ΔG°
kcal/mole
IC50
nM
Kd
nM
EC50/IC50
nM
koff
s-1
kon
M-1s-1
pHTemp
°C
Nuclear receptor subfamily 1 group D member 2
(Homo sapiens (Human))
US20240002380, Example 5
Reactome pathway
n/an/a<1.00E+3n/an/an/an/an/an/a
TBA
Citation and Details
Nuclear receptor subfamily 1 group D member 1
(Homo sapiens (Human))
US20240002380, Example 5
Reactome pathway
n/an/a<250n/an/an/an/an/an/a
TBA
Citation and Details