null
SMILES:
InChI Key:
Activity Spreadsheet -- Enzyme Inhibition Constant Data from BindingDB
Found 1 hit for monomerid = 643195
Trg + Lig
Ki
nM
ΔG°
kcal/mole
IC50
nM
Kd
nM
EC50/IC50
nM
koff
s-1
kon
M-1s-1
pHTemp
°C
Nuclear receptor subfamily 1 group D member 2
(Homo sapiens (Human))
US20240002380, Example 51
Reactome pathway
n/an/a>1.00E+4n/an/an/an/an/an/a
TBA
Citation and Details