BDBM7163 3-Phenylacetamidoaminopyrazole deriv. 40::CS10::N-(5-Cyclopropyl-1H-pyrazol-3-yl)-2-(4-thien-2-ylphenyl)acetamide::N-(5-cyclopropyl-1H-pyrazol-3-yl)-2-[4-(thiophen-2-yl)phenyl]acetamide
SMILES: O=C(Cc1ccc(cc1)-c1cccs1)Nc1cc(n[nH]1)C1CC1
InChI Key: InChIKey=LQBKAYJFACGUCC-UHFFFAOYSA-N
Data: 1 IC50  3 Kd
PDB links: 1 PDB ID matches this monomer.
Activity Spreadsheet -- Enzyme Inhibition Constant Data from BindingDB
Found 4 hits for monomerid = 7163
Trg + Lig
Ki
nM
ΔG°
kcal/mole
IC50
nM
Kd
nM
EC50/IC50
nM
koff
s-1
kon
M-1s-1
pHTemp
°C
Cyclin-Dependent Kinase 2 (CDK2)
(Homo sapiens (Human))
BDBM7163
(3-Phenylacetamidoaminopyrazole deriv. 40 | CS10 | ...)
Show SMILES O=C(Cc1ccc(cc1)-c1cccs1)Nc1cc(n[nH]1)C1CC1
Show InChI InChI=1S/C18H17N3OS/c22-18(19-17-11-15(20-21-17)13-7-8-13)10-12-3-5-14(6-4-12)16-2-1-9-23-16/h1-6,9,11,13H,7-8,10H2,(H2,19,20,21,22)
NCI pathway
Reactome pathway
n/an/a 3n/an/an/an/an/an/a
Pharmacia Italia
Assay Description
The biochemical activity of compounds was determined by incubation with specific enzymes and substrates in the presence ATP/[gamma-33P] ATP. After in...
J Med Chem 47: 3367-80 (2004)
Article DOI: 10.1021/jm031145u
BindingDB Entry DOI: 10.7270/Q2RX998G
Cyclin-Dependent Kinase 2 (CDK2)
(Homo sapiens (Human))
BDBM7163
(3-Phenylacetamidoaminopyrazole deriv. 40 | CS10 | ...)
Show SMILES O=C(Cc1ccc(cc1)-c1cccs1)Nc1cc(n[nH]1)C1CC1
Show InChI InChI=1S/C18H17N3OS/c22-18(19-17-11-15(20-21-17)13-7-8-13)10-12-3-5-14(6-4-12)16-2-1-9-23-16/h1-6,9,11,13H,7-8,10H2,(H2,19,20,21,22)
NCI pathway
Reactome pathway
n/an/an/a 79n/an/an/a7.525
CSAR
Assay Description
OctetRed
CSAR 1: (2012)
Cyclin-dependent kinase 2
(Homo sapiens (Human))
BDBM7163
(3-Phenylacetamidoaminopyrazole deriv. 40 | CS10 | ...)
Show SMILES O=C(Cc1ccc(cc1)-c1cccs1)Nc1cc(n[nH]1)C1CC1
Show InChI InChI=1S/C18H17N3OS/c22-18(19-17-11-15(20-21-17)13-7-8-13)10-12-3-5-14(6-4-12)16-2-1-9-23-16/h1-6,9,11,13H,7-8,10H2,(H2,19,20,21,22)
NCI pathway
Reactome pathway
n/an/an/a 910n/an/an/a7.525
CSAR
Assay Description
OctetRed
CSAR 1: (2012)
Cyclin-dependent kinase 2
(Homo sapiens (Human))
BDBM7163
(3-Phenylacetamidoaminopyrazole deriv. 40 | CS10 | ...)
Show SMILES O=C(Cc1ccc(cc1)-c1cccs1)Nc1cc(n[nH]1)C1CC1
Show InChI InChI=1S/C18H17N3OS/c22-18(19-17-11-15(20-21-17)13-7-8-13)10-12-3-5-14(6-4-12)16-2-1-9-23-16/h1-6,9,11,13H,7-8,10H2,(H2,19,20,21,22)
NCI pathway
Reactome pathway
n/an/an/a 4.96E+3n/an/an/a7.525
CSAR
Assay Description
Thermofluor
CSAR 1: (2012)