BDBM75032 MLS000691962::N,N-dimethyl-N'-[7-(2-thienyl)[1,2,4]triazolo[1,5-a]pyrimidin-2-yl]iminoformamide::N,N-dimethyl-N'-(7-thiophen-2-yl-[1,2,4]triazolo[1,5-a]pyrimidin-2-yl)methanimidamide::N,N-dimethyl-N'-[7-(2-thienyl)-[1,2,4]triazolo[1,5-a]pyrimidin-2-yl]formamidine::SMR000334002::cid_2767358
SMILES: CN(C)C=Nc1nc2nccc(-c3cccs3)n2n1
InChI Key: InChIKey=QUVBYDIHFHODIR-UHFFFAOYSA-N
Data: 1 EC50
Activity Spreadsheet -- Enzyme Inhibition Constant Data from BindingDB
Found 1 hit for monomerid = 75032
Trg + Lig
Ki
nM
ΔG°
kcal/mole
IC50
nM
Kd
nM
EC50/IC50
nM
koff
s-1
kon
M-1s-1
pHTemp
°C
Importin subunit alpha-1
(Homo sapiens (Human))
BDBM75032
(MLS000691962 | N,N-dimethyl-N'-[7-(2-thienyl)[...)
Show SMILES CN(C)C=Nc1nc2nccc(-c3cccs3)n2n1
Show InChI InChI=1S/C12H12N6S/c1-17(2)8-14-11-15-12-13-6-5-9(18(12)16-11)10-4-3-7-19-10/h3-8H,1-2H3
Reactome pathway
PCBioAssay
n/an/an/an/a 1.38E+4n/an/an/an/a
Broad Institute
Curated by PubChem BioAssay
Assay Description
Keywords: Counterscreen, FRET assay, HTS, YIC probe, Dose response, Assay Overview: This is a fluorescence resonance energy transfer (FRET)-based b...
PubChem Bioassay (2010)
BindingDB Entry DOI: 10.7270/Q280513R