BDBM7762 N-Methyl-4-{[(2-oxo-1,2-dihydro-3H-indol-3-ylidene)-methyl]amino}benzenesulfonamide::N-methyl-4-({[(3Z)-2-oxo-2,3-dihydro-1H-indol-3-ylidene]methyl}amino)benzene-1-sulfonamide::Oxindole-Based Inhibitor 98
SMILES: CNS(=O)(=O)c1ccc(cc1)N=CC1C(=O)Nc2ccccc12
InChI Key: InChIKey=XTPZAFMBWDNWIW-UHFFFAOYSA-N
Data: 2 IC50
PDB links: 1 PDB ID matches this monomer. 1 PDB ID contains this monomer as substructures. 1 PDB ID contains inhibitors having a similarity of 90% to this monomer.
Activity Spreadsheet -- Enzyme Inhibition Constant Data from BindingDB
Found 2 hits for monomerid = 7762
Trg + Lig
Ki
nM
ΔG°
kcal/mole
IC50
nM
Kd
nM
EC50/IC50
nM
koff
s-1
kon
M-1s-1
pHTemp
°C
Cyclin-Dependent Kinase 2 (CDK2)
(Homo sapiens (Human))
BDBM7762
(N-Methyl-4-{[(2-oxo-1,2-dihydro-3H-indol-3-ylidene...)
Show SMILES CNS(=O)(=O)c1ccc(cc1)N=CC1C(=O)Nc2ccccc12 |w:12.13|
Show InChI InChI=1S/C16H15N3O3S/c1-17-23(21,22)12-8-6-11(7-9-12)18-10-14-13-4-2-3-5-15(13)19-16(14)20/h2-10,14,17H,1H3,(H,19,20)
NCI pathway
Reactome pathway
n/an/a 560n/an/an/an/an/an/a
GlaxoSmithKline
Assay Description
The biochemical activity of compounds was determined by incubation with specific enzymes and substrates in the presence 1.4 uM ATP/[gamma-32P] ATP. A...
J Med Chem 44: 4339-58 (2001)
Article DOI: 10.1021/jm010117d
BindingDB Entry DOI: 10.7270/Q2ST7N10
3D
3D Structure (crystal)
Cyclin-Dependent Kinase 1 (CDK1)
(Homo sapiens (Human))
BDBM7762
(N-Methyl-4-{[(2-oxo-1,2-dihydro-3H-indol-3-ylidene...)
Show SMILES CNS(=O)(=O)c1ccc(cc1)N=CC1C(=O)Nc2ccccc12 |w:12.13|
Show InChI InChI=1S/C16H15N3O3S/c1-17-23(21,22)12-8-6-11(7-9-12)18-10-14-13-4-2-3-5-15(13)19-16(14)20/h2-10,14,17H,1H3,(H,19,20)
Reactome pathway
n/an/a 2.90E+3n/an/an/an/an/an/a
GlaxoSmithKline
Assay Description
The biochemical activity of compounds was determined by incubation with specific enzymes and substrates in the presence 1.4 uM ATP/[gamma-32P] ATP. A...
J Med Chem 44: 4339-58 (2001)
Article DOI: 10.1021/jm010117d
BindingDB Entry DOI: 10.7270/Q2ST7N10