BDBM81015 MLS000109203::N-(4-bromophenyl)-1-(3-pyridinyl)methanimine oxide::N-(4-bromophenyl)-1-(3-pyridyl)methanimine oxide::N-(4-bromophenyl)-1-pyridin-3-yl-methanimine oxide::N-(4-bromophenyl)-1-pyridin-3-ylmethanimine oxide::SMR000105149::cid_877195
SMILES: [O-]\[N+](=C\c1cccnc1)c1ccc(Br)cc1
InChI Key: InChIKey=SZSQCHUSFQKHOD-OQLLNIDSSA-N
Data: 4 IC50
Activity Spreadsheet -- Enzyme Inhibition Constant Data from BindingDB
Found 4 hits for monomerid = 81015
Trg + Lig
Ki
nM
ΔG°
kcal/mole
IC50
nM
Kd
nM
EC50/IC50
nM
koff
s-1
kon
M-1s-1
pHTemp
°C
Glucose 6-phosphate dehydrogenase (G6PD)
(Homo sapiens (Human))
BDBM81015
(MLS000109203 | N-(4-bromophenyl)-1-(3-pyridinyl)me...)
Show SMILES [O-]\[N+](=C\c1cccnc1)c1ccc(Br)cc1
Show InChI InChI=1S/C12H9BrN2O/c13-11-3-5-12(6-4-11)15(16)9-10-2-1-7-14-8-10/h1-9H/b15-9+
PCBioAssay
n/an/a 2.82E+4n/an/an/an/an/an/a
Burnham Center for Chemical Genomics
Curated by PubChem BioAssay
Assay Description
Data Source: Sanford-Burnham Center for Chemical Genomics (SBCCG) Source Affiliation: Sanford-Burnham Medical Research Institute (SBMRI, San Diego CA...
PubChem Bioassay (2011)
BindingDB Entry DOI: 10.7270/Q2V12389
glucose-6-phosphate dehydrogenase-6-phosphogluconolactonase
(Plasmodium falciparum 3D7)
BDBM81015
(MLS000109203 | N-(4-bromophenyl)-1-(3-pyridinyl)me...)
Show SMILES [O-]\[N+](=C\c1cccnc1)c1ccc(Br)cc1
Show InChI InChI=1S/C12H9BrN2O/c13-11-3-5-12(6-4-11)15(16)9-10-2-1-7-14-8-10/h1-9H/b15-9+
PCBioAssay
n/an/a 7.71E+4n/an/an/an/an/an/a
Burnham Center for Chemical Genomics
Curated by PubChem BioAssay
Assay Description
Data Source: Sanford-Burnham Center for Chemical Genomics (SBCCG) Source Affiliation: Sanford-Burnham Medical Research Institute (SBMRI, San Diego CA...
PubChem Bioassay (2011)
BindingDB Entry DOI: 10.7270/Q23T9FQ1
glucose-6-phosphate dehydrogenase-6-phosphogluconolactonase
(Plasmodium falciparum 3D7)
BDBM81015
(MLS000109203 | N-(4-bromophenyl)-1-(3-pyridinyl)me...)
Show SMILES [O-]\[N+](=C\c1cccnc1)c1ccc(Br)cc1
Show InChI InChI=1S/C12H9BrN2O/c13-11-3-5-12(6-4-11)15(16)9-10-2-1-7-14-8-10/h1-9H/b15-9+
PCBioAssay
n/an/a>8.00E+4n/an/an/an/an/an/a
Burnham Center for Chemical Genomics
Curated by PubChem BioAssay
Assay Description
Data Source: Sanford-Burnham Center for Chemical Genomics (SBCCG) Source Affiliation: Sanford-Burnham Medical Research Institute (SBMRI, San Diego CA...
PubChem Bioassay (2011)
BindingDB Entry DOI: 10.7270/Q27H1H3W
glucose-6-phosphate dehydrogenase-6-phosphogluconolactonase
(Plasmodium falciparum 3D7)
BDBM81015
(MLS000109203 | N-(4-bromophenyl)-1-(3-pyridinyl)me...)
Show SMILES [O-]\[N+](=C\c1cccnc1)c1ccc(Br)cc1
Show InChI InChI=1S/C12H9BrN2O/c13-11-3-5-12(6-4-11)15(16)9-10-2-1-7-14-8-10/h1-9H/b15-9+
PCBioAssay
n/an/a 1.11E+3n/an/an/an/an/an/a
Burnham Center for Chemical Genomics
Curated by PubChem BioAssay
Assay Description
Data Source: Sanford-Burnham Center for Chemical Genomics (SBCCG) Source Affiliation: Sanford-Burnham Medical Research Institute (SBMRI, San Diego CA...
PubChem Bioassay (2011)
BindingDB Entry DOI: 10.7270/Q2ZS2TZG