BDBM85191 Ac-RYYRWK-NH2::CAS_200959-47-3
SMILES: CC(=O)N[C@@H](CCCNC(N)=N)C(=O)N[C@@H](Cc1ccc(O)cc1)C(=O)N[C@@H](Cc1ccc(O)cc1)C(=O)N[C@@H](CCCNC(N)=N)C(=O)N[C@@H](Cc1c[nH]c2ccccc12)C(=O)N[C@@H](CCCCN)C(N)=O
InChI Key: InChIKey=YROQVQIJRORFAZ-SKGSPYGFSA-N
Data: 1 KI  2 EC50
Activity Spreadsheet -- Enzyme Inhibition Constant Data from BindingDB
Found 3 hits for monomerid = 85191
Trg + Lig
Ki
nM
ΔG°
kcal/mole
IC50
nM
Kd
nM
EC50/IC50
nM
koff
s-1
kon
M-1s-1
pHTemp
°C
Nociceptin/Orphanin FQ, NOP receptor
(MOUSE)
BDBM85191
(Ac-RYYRWK-NH2 | CAS_200959-47-3)
Show SMILES CC(=O)N[C@@H](CCCNC(N)=N)C(=O)N[C@@H](Cc1ccc(O)cc1)C(=O)N[C@@H](Cc1ccc(O)cc1)C(=O)N[C@@H](CCCNC(N)=N)C(=O)N[C@@H](Cc1c[nH]c2ccccc12)C(=O)N[C@@H](CCCCN)C(N)=O |r|
Show InChI InChI=1S/C49H69N15O9/c1-28(65)59-37(11-6-22-56-48(52)53)43(69)62-40(25-30-15-19-33(67)20-16-30)46(72)63-39(24-29-13-17-32(66)18-14-29)45(71)61-38(12-7-23-57-49(54)55)44(70)64-41(26-31-27-58-35-9-3-2-8-34(31)35)47(73)60-36(42(51)68)10-4-5-21-50/h2-3,8-9,13-20,27,36-41,58,66-67H,4-7,10-12,21-26,50H2,1H3,(H2,51,68)(H,59,65)(H,60,73)(H,61,71)(H,62,69)(H,63,72)(H,64,70)(H4,52,53,56)(H4,54,55,57)/t36-,37-,38-,39-,40-,41-/m0/s1
0.710n/an/an/an/an/an/an/an/a
Torrey Pines Institute for Molecular Studies
Curated by PDSP Ki Database
J Pharmacol Exp Ther 283: 735-41 (1997)
BindingDB Entry DOI: 10.7270/Q2JW8CDH
Nociceptin/mu opioid receptor
(RAT)
BDBM85191
(Ac-RYYRWK-NH2 | CAS_200959-47-3)
Show SMILES CC(=O)N[C@@H](CCCNC(N)=N)C(=O)N[C@@H](Cc1ccc(O)cc1)C(=O)N[C@@H](Cc1ccc(O)cc1)C(=O)N[C@@H](CCCNC(N)=N)C(=O)N[C@@H](Cc1c[nH]c2ccccc12)C(=O)N[C@@H](CCCCN)C(N)=O |r|
Show InChI InChI=1S/C49H69N15O9/c1-28(65)59-37(11-6-22-56-48(52)53)43(69)62-40(25-30-15-19-33(67)20-16-30)46(72)63-39(24-29-13-17-32(66)18-14-29)45(71)61-38(12-7-23-57-49(54)55)44(70)64-41(26-31-27-58-35-9-3-2-8-34(31)35)47(73)60-36(42(51)68)10-4-5-21-50/h2-3,8-9,13-20,27,36-41,58,66-67H,4-7,10-12,21-26,50H2,1H3,(H2,51,68)(H,59,65)(H,60,73)(H,61,71)(H,62,69)(H,63,72)(H,64,70)(H4,52,53,56)(H4,54,55,57)/t36-,37-,38-,39-,40-,41-/m0/s1
Reactome pathway
n/an/an/an/a 16n/an/an/an/a
Bulgarian Academy of Sciences
Curated by ChEMBL
Assay Description
Activity at Wistar rat NOP receptor assessed as inhibition of low-frequency electrically-stimulated vas deferens contraction
Bioorg Med Chem Lett 23: 4052-5 (2013)
Article DOI: 10.1016/j.bmcl.2013.05.064
BindingDB Entry DOI: 10.7270/Q2639SNZ
Nociceptin/mu opioid receptor
(RAT)
BDBM85191
(Ac-RYYRWK-NH2 | CAS_200959-47-3)
Show SMILES CC(=O)N[C@@H](CCCNC(N)=N)C(=O)N[C@@H](Cc1ccc(O)cc1)C(=O)N[C@@H](Cc1ccc(O)cc1)C(=O)N[C@@H](CCCNC(N)=N)C(=O)N[C@@H](Cc1c[nH]c2ccccc12)C(=O)N[C@@H](CCCCN)C(N)=O |r|
Show InChI InChI=1S/C49H69N15O9/c1-28(65)59-37(11-6-22-56-48(52)53)43(69)62-40(25-30-15-19-33(67)20-16-30)46(72)63-39(24-29-13-17-32(66)18-14-29)45(71)61-38(12-7-23-57-49(54)55)44(70)64-41(26-31-27-58-35-9-3-2-8-34(31)35)47(73)60-36(42(51)68)10-4-5-21-50/h2-3,8-9,13-20,27,36-41,58,66-67H,4-7,10-12,21-26,50H2,1H3,(H2,51,68)(H,59,65)(H,60,73)(H,61,71)(H,62,69)(H,63,72)(H,64,70)(H4,52,53,56)(H4,54,55,57)/t36-,37-,38-,39-,40-,41-/m0/s1
Reactome pathway
n/an/an/an/a 6.20n/an/an/an/a
Bulgarian Academy of Sciences
Curated by ChEMBL
Assay Description
Activity at Wistar rat NOP receptor assessed as inhibition of low-frequency electrically-stimulated vas deferens contraction in presence of naloxone
Bioorg Med Chem Lett 23: 4052-5 (2013)
Article DOI: 10.1016/j.bmcl.2013.05.064
BindingDB Entry DOI: 10.7270/Q2639SNZ