BDBM91828 Chk1_102
SMILES: COC(=O)Cc1ccc2Nc3cc(ccc3C(=O)Nc2c1)-c1cncn1C
InChI Key: InChIKey=VHPMIVHLGSAOKI-UHFFFAOYSA-N
Data: 3 KI  1 IC50
PDB links: 1 PDB ID matches this monomer.
Activity Spreadsheet -- Enzyme Inhibition Constant Data from BindingDB
Found 4 hits for monomerid = 91828
Trg + Lig
Ki
nM
ΔG°
kcal/mole
IC50
nM
Kd
nM
EC50/IC50
nM
koff
s-1
kon
M-1s-1
pHTemp
°C
Serine/threonine-protein kinase Chk1 [2-280]
(Homo sapiens (Human))
BDBM91828
(Chk1_102)
Show SMILES COC(=O)Cc1ccc2Nc3cc(ccc3C(=O)Nc2c1)-c1cncn1C
Show InChI InChI=1S/C20H18N4O3/c1-24-11-21-10-18(24)13-4-5-14-16(9-13)22-15-6-3-12(8-19(25)27-2)7-17(15)23-20(14)26/h3-7,9-11,22H,8H2,1-2H3,(H,23,26)
D3R
75.6n/an/an/an/an/an/an/an/a
D3R
Assay Description
33P-Radiometric_Method1
D3R 221: (2015)
BindingDB Entry DOI: 10.7270/Q2WS8S4Z
3D
3D Structure (crystal)
Serine/threonine-protein kinase Chk1
(Homo sapiens (Human))
BDBM91828
(Chk1_102)
Show SMILES COC(=O)Cc1ccc2Nc3cc(ccc3C(=O)Nc2c1)-c1cncn1C
Show InChI InChI=1S/C20H18N4O3/c1-24-11-21-10-18(24)13-4-5-14-16(9-13)22-15-6-3-12(8-19(25)27-2)7-17(15)23-20(14)26/h3-7,9-11,22H,8H2,1-2H3,(H,23,26)
Reactome pathway
79n/an/an/an/an/an/an/an/a
Abbott Laboratories
Curated by ChEMBL
Assay Description
Inhibition of Chk1
J Med Chem 52: 3159-65 (2009)
Article DOI: 10.1021/jm801444x
BindingDB Entry DOI: 10.7270/Q2FF3TM8
3D
3D Structure (crystal)
Serine/threonine-protein kinase Chk1
(Homo sapiens (Human))
BDBM91828
(Chk1_102)
Show SMILES COC(=O)Cc1ccc2Nc3cc(ccc3C(=O)Nc2c1)-c1cncn1C
Show InChI InChI=1S/C20H18N4O3/c1-24-11-21-10-18(24)13-4-5-14-16(9-13)22-15-6-3-12(8-19(25)27-2)7-17(15)23-20(14)26/h3-7,9-11,22H,8H2,1-2H3,(H,23,26)
Reactome pathway
79n/an/an/an/an/an/an/an/a
CSAR
Assay Description
ChemBL affinity - Published Abbott papers
CSAR 1: (2012)
3D
3D Structure (crystal)
Serine/threonine-protein kinase Chk1
(Homo sapiens (Human))
BDBM91828
(Chk1_102)
Show SMILES COC(=O)Cc1ccc2Nc3cc(ccc3C(=O)Nc2c1)-c1cncn1C
Show InChI InChI=1S/C20H18N4O3/c1-24-11-21-10-18(24)13-4-5-14-16(9-13)22-15-6-3-12(8-19(25)27-2)7-17(15)23-20(14)26/h3-7,9-11,22H,8H2,1-2H3,(H,23,26)
Reactome pathway
n/an/a 76n/an/an/an/an/an/a
CSAR
Assay Description
Abbott Kinase Enzymatics_CHK1/289 CDC25c - IC50(uM) (IC50)
CSAR 1: (2012)
3D
3D Structure (crystal)