BDBM93092 Analogue of 1a, 8p
SMILES: CN(c1c(N)n(Cc2ccccc2)c(=O)[nH]c1=O)S(=O)(=O)c1cccc(C)c1
InChI Key: InChIKey=BMPTWGBWJRVEGN-UHFFFAOYSA-N
Data: 1 IC50
PDB links: 1 PDB ID matches this monomer.
Activity Spreadsheet -- Enzyme Inhibition Constant Data from BindingDB
Found 1 hit for monomerid = 93092
Trg + Lig
Ki
nM
ΔG°
kcal/mole
IC50
nM
Kd
nM
EC50/IC50
nM
koff
s-1
kon
M-1s-1
pHTemp
°C
Glucose-1-phosphate thymidylyltransferase (RmlA)
(Pseudomonas aeruginosa)
BDBM93092
(Analogue of 1a, 8p)
Show SMILES CN(c1c(N)n(Cc2ccccc2)c(=O)[nH]c1=O)S(=O)(=O)c1cccc(C)c1
Show InChI InChI=1S/C19H20N4O4S/c1-13-7-6-10-15(11-13)28(26,27)22(2)16-17(20)23(19(25)21-18(16)24)12-14-8-4-3-5-9-14/h3-11H,12,20H2,1-2H3,(H,21,24,25)
n/an/a 387n/an/an/an/an/an/a
University of St. Andrews
Assay Description
Inhibition assay using glucose-1-phosphate thymidylyltransferase (RmlA).
ACS Chem Biol 8: 387-96 (2013)
Article DOI: 10.1021/cb300426u
BindingDB Entry DOI: 10.7270/Q26D5RMP
3D
3D Structure (crystal)