Reaction Details
TargetCarboxypeptidase B2
LigandBDBM173886
Substrate/Competitorn/a
Meas. Tech.TAFI Activity Assay
pH7.4±n/a
Temperature298.15±n/a K
IC50 6.00±n/a nM
Commentsextracted
Citation Kallus, CBroenstrup, MEvers, AGlobisch, ASchreuder, HWagner, M Macrocyclic urea and sulfamide derivatives as inhibitors of TAFIa US Patent US9688645 Publication Date 6/27/2017
 
Carboxypeptidase B2
Name:Carboxypeptidase B2
Type:Enzyme
Mol. Mass.:48432.74
Organism:Homo sapiens (Human)
Description:Q96IY4
Residue:423
BDBM173886
NameBDBM173886
Synonyms:US9688645, 1-1
TypeSmall organic molecule
Emp. Form.C25H40N4O6
Mol. Mass.492.6083
SMILESCC(C)[C@H]1COCCCCOc2ccc(C[C@@H](NC(=O)N[C@@H](CCCCN)C(O)=O)C(=O)N1)cc2