Reaction Details
TargetCarboxypeptidase B2
LigandBDBM173906
Substrate/Competitorn/a
Meas. Tech.TAFI Activity Assay
pH7.4±n/a
Temperature298.15±n/a K
IC50 7.70±n/a nM
Commentsextracted
Citation Kallus, CBroenstrup, MEvers, AGlobisch, ASchreuder, HWagner, M Macrocyclic urea and sulfamide derivatives as inhibitors of TAFIa US Patent US9688645 Publication Date 6/27/2017
 
Carboxypeptidase B2
Name:Carboxypeptidase B2
Type:Enzyme
Mol. Mass.:48432.74
Organism:Homo sapiens (Human)
Description:Q96IY4
Residue:423
BDBM173906
NameBDBM173906
Synonyms:US9688645, 3-1
TypeSmall organic molecule
Emp. Form.C25H38N4O6
Mol. Mass.490.5924
SMILESCC(C)[C@H]1COC\C=C\COc2ccc(C[C@@H](NC(=O)N[C@@H](CCCCN)C(O)=O)C(=O)N1)cc2