Reaction Details
TargetcAMP-specific 3',5'-cyclic phosphodiesterase 4C
LigandBDBM285530
Substrate/Competitorn/a
IC50 51.9±n/a nM
Citation Chappie, TAVerhoest, PRPatel, NCHayward, MMHelal, CJSciabola, SLaChapelle, EAYoung, JM Imidazopyridazine compounds US Patent US9598421 Publication Date 3/21/2017
 
cAMP-specific 3',5'-cyclic phosphodiesterase 4C
Name:cAMP-specific 3',5'-cyclic phosphodiesterase 4C
Type:Enzyme Catalytic Domain
Mol. Mass.:79875.54
Organism:Homo sapiens (Human)
Description:Q08493
Residue:712
BDBM285530
NameBDBM285530
Synonyms:Azetidin-1-yl[3-(3,5-difluoro-4-methoxyphenyl)imidazo[1,2-b]pyridazin-2-yl]methanone (3) US10669279, Example 3 | US9598421, Example 3
TypeSmall organic molecule
Emp. Form.C17H14F2N4O2
Mol. Mass.344.3155
SMILESCOc1c(F)cc(cc1F)-c1c(nc2cccnn12)C(=O)N1CCC1