Reaction Details
TargetcAMP-specific 3',5'-cyclic phosphodiesterase 4B
LigandBDBM285534
Substrate/Competitorn/a
IC50<1.89±n/a nM
Citation Chappie, TAVerhoest, PRPatel, NCHayward, MMHelal, CJSciabola, SLaChapelle, EAYoung, JM Imidazopyridazine compounds US Patent US9598421 Publication Date 3/21/2017
 
cAMP-specific 3',5'-cyclic phosphodiesterase 4B
Name:cAMP-specific 3',5'-cyclic phosphodiesterase 4B
Type:Protein
Mol. Mass.:83318.87
Organism:Homo sapiens (Human)
Description:Q07343
Residue:736
BDBM285534
NameBDBM285534
Synonyms:3-(4-Chloro-3-fluorophenyl)-N-(1-methyl-1H-pyrazol-4-yl)imidazo[1,2-b]pyridazine-2-carboxamide (7) US10669279, Example 7 | US9598421, Example 7
TypeSmall organic molecule
Emp. Form.C17H12ClFN6O
Mol. Mass.370.768
SMILESCn1cc(NC(=O)c2nc3cccnn3c2-c2ccc(Cl)c(F)c2)cn1