Reaction Details
TargetcAMP-specific 3',5'-cyclic phosphodiesterase 4A
LigandBDBM285547
Substrate/Competitorn/a
Meas. Tech.Scintillation Proximity Assay (SPA)
IC50 6.70±n/a nM
Citation Chappie, TAVerhoest, PRPatel, NCHayward, MMHelal, CJSciabola, SLaChapelle, EAYoung, JM Imidazopyridazine compounds US Patent US9598421 Publication Date 3/21/2017
 
cAMP-specific 3',5'-cyclic phosphodiesterase 4A
Name:cAMP-specific 3',5'-cyclic phosphodiesterase 4A
Type:Enzyme
Mol. Mass.:98113.27
Organism:Homo sapiens (Human)
Description:P27815
Residue:886
BDBM285547
NameBDBM285547
Synonyms:4-[2-(azetidin-1-ylcarbonyl)imidazo[1,2-b]pyridazin-3-yl]-2-fluoro-5-methylbenzonitrile US10669279, Example 20 | US9598421, Example 20
TypeSmall organic molecule
Emp. Form.C18H14FN5O
Mol. Mass.335.3351
SMILESCc1cc(C#N)c(F)cc1-c1c(nc2cccnn12)C(=O)N1CCC1