Reaction Details
TargetcAMP-specific 3',5'-cyclic phosphodiesterase 4A
LigandBDBM285550
Substrate/Competitorn/a
Meas. Tech.Scintillation Proximity Assay (SPA)
IC50 15.1±n/a nM
Citation Chappie, TAVerhoest, PRPatel, NCHayward, MMHelal, CJSciabola, SLaChapelle, EAYoung, JM Imidazopyridazine compounds US Patent US9598421 Publication Date 3/21/2017
 
cAMP-specific 3',5'-cyclic phosphodiesterase 4A
Name:cAMP-specific 3',5'-cyclic phosphodiesterase 4A
Type:Enzyme
Mol. Mass.:98113.27
Organism:Homo sapiens (Human)
Description:P27815
Residue:886
BDBM285550
NameBDBM285550
Synonyms:4-[2-(azetidin-1-ylcarbonyl)imidazo[1,2-b]pyridazin-3-yl]-2-fluorobenzonitrile US10669279, Example 23 | US9598421, Example 23
TypeSmall organic molecule
Emp. Form.C17H12FN5O
Mol. Mass.321.3085
SMILESFc1cc(ccc1C#N)-c1c(nc2cccnn12)C(=O)N1CCC1