Reaction Details
TargetcAMP-specific 3',5'-cyclic phosphodiesterase 4C
LigandBDBM285551
Substrate/Competitorn/a
IC50 59.7±n/a nM
Citation Chappie, TAVerhoest, PRPatel, NCHayward, MMHelal, CJSciabola, SLaChapelle, EAYoung, JM Imidazopyridazine compounds US Patent US9598421 Publication Date 3/21/2017
 
cAMP-specific 3',5'-cyclic phosphodiesterase 4C
Name:cAMP-specific 3',5'-cyclic phosphodiesterase 4C
Type:Enzyme Catalytic Domain
Mol. Mass.:79875.54
Organism:Homo sapiens (Human)
Description:Q08493
Residue:712
BDBM285551
NameBDBM285551
Synonyms:4-[2-(azetidin-1-ylcarbonyl)imidazo[1,2-b]pyridazin-3-yl]-2,5-difluorobenzonitrile US10669279, Example 24 | US9598421, Example 24
TypeSmall organic molecule
Emp. Form.C17H11F2N5O
Mol. Mass.339.2989
SMILESFc1cc(-c2c(nc3cccnn23)C(=O)N2CCC2)c(F)cc1C#N