Reaction Details
TargetcAMP-specific 3',5'-cyclic phosphodiesterase 4C
LigandBDBM285556
Substrate/Competitorn/a
IC50 13.8±n/a nM
Citation Chappie, TAVerhoest, PRPatel, NCHayward, MMHelal, CJSciabola, SLaChapelle, EAYoung, JM Imidazopyridazine compounds US Patent US9598421 Publication Date 3/21/2017
 
cAMP-specific 3',5'-cyclic phosphodiesterase 4C
Name:cAMP-specific 3',5'-cyclic phosphodiesterase 4C
Type:Enzyme Catalytic Domain
Mol. Mass.:79875.54
Organism:Homo sapiens (Human)
Description:Q08493
Residue:712
BDBM285556
NameBDBM285556
Synonyms:3-(4-chloro-3-fluorophenyl)-N-propylimidazo[1,2-b]pyridazine-2-carboxamide US10669279, Example 29 | US9598421, Example 29
TypeSmall organic molecule
Emp. Form.C16H14ClFN4O
Mol. Mass.332.76
SMILESCCCNC(=O)c1nc2cccnn2c1-c1ccc(Cl)c(F)c1