Reaction Details
TargetcAMP-specific 3',5'-cyclic phosphodiesterase 4C
LigandBDBM285561
Substrate/Competitorn/a
IC50 47.0±n/a nM
Citation Chappie, TAVerhoest, PRPatel, NCHayward, MMHelal, CJSciabola, SLaChapelle, EAYoung, JM Imidazopyridazine compounds US Patent US9598421 Publication Date 3/21/2017
 
cAMP-specific 3',5'-cyclic phosphodiesterase 4C
Name:cAMP-specific 3',5'-cyclic phosphodiesterase 4C
Type:Enzyme Catalytic Domain
Mol. Mass.:79875.54
Organism:Homo sapiens (Human)
Description:Q08493
Residue:712
BDBM285561
NameBDBM285561
Synonyms:3-(3-chloro-5-fluorophenyl)-N-propylimidazo[1,2-b]pyridazine-2-carboxamide US10669279, Example 34 | US9598421, Example 34
TypeSmall organic molecule
Emp. Form.C16H14ClFN4O
Mol. Mass.332.76
SMILESCCCNC(=O)c1nc2cccnn2c1-c1cc(F)cc(Cl)c1