Reaction Details
TargetcAMP-specific 3',5'-cyclic phosphodiesterase 4A
LigandBDBM285563
Substrate/Competitorn/a
Meas. Tech.Scintillation Proximity Assay (SPA)
IC50 23.7±n/a nM
Citation Chappie, TAVerhoest, PRPatel, NCHayward, MMHelal, CJSciabola, SLaChapelle, EAYoung, JM Imidazopyridazine compounds US Patent US9598421 Publication Date 3/21/2017
 
cAMP-specific 3',5'-cyclic phosphodiesterase 4A
Name:cAMP-specific 3',5'-cyclic phosphodiesterase 4A
Type:Enzyme
Mol. Mass.:98113.27
Organism:Homo sapiens (Human)
Description:P27815
Residue:886
BDBM285563
NameBDBM285563
Synonyms:3-(3-chlorophenyl)-N-cyclopropylimidazo[1,2-b]pyridazine-2-carboxamide US10669279, Example 36 | US9598421, Example 36
TypeSmall organic molecule
Emp. Form.C16H13ClN4O
Mol. Mass.312.754
SMILESClc1cccc(c1)-c1c(nc2cccnn12)C(=O)NC1CC1