Reaction Details
TargetcAMP-specific 3',5'-cyclic phosphodiesterase 4A
LigandBDBM285566
Substrate/Competitorn/a
Meas. Tech.Scintillation Proximity Assay (SPA)
IC50 14.8±n/a nM
Citation Chappie, TAVerhoest, PRPatel, NCHayward, MMHelal, CJSciabola, SLaChapelle, EAYoung, JM Imidazopyridazine compounds US Patent US9598421 Publication Date 3/21/2017
 
cAMP-specific 3',5'-cyclic phosphodiesterase 4A
Name:cAMP-specific 3',5'-cyclic phosphodiesterase 4A
Type:Enzyme
Mol. Mass.:98113.27
Organism:Homo sapiens (Human)
Description:P27815
Residue:886
BDBM285566
NameBDBM285566
Synonyms:3-(1,3-benzoxazol-5-yl)-N-cyclopropylimidazo[1,2-b]pyridazine-2-carboxamide US10669279, Example 39 | US9598421, Example 39
TypeSmall organic molecule
Emp. Form.C17H13N5O2
Mol. Mass.319.3174
SMILESO=C(NC1CC1)c1nc2cccnn2c1-c1ccc2ocnc2c1