Reaction Details
TargetcAMP-specific 3',5'-cyclic phosphodiesterase 4D
LigandBDBM285571
Substrate/Competitorn/a
IC50 320±n/a nM
Citation Chappie, TAVerhoest, PRPatel, NCHayward, MMHelal, CJSciabola, SLaChapelle, EAYoung, JM Imidazopyridazine compounds US Patent US9598421 Publication Date 3/21/2017
 
cAMP-specific 3',5'-cyclic phosphodiesterase 4D
Name:cAMP-specific 3',5'-cyclic phosphodiesterase 4D
Type:Protein
Mol. Mass.:91092.69
Organism:Homo sapiens (Human)
Description:Q08499
Residue:809
BDBM285571
NameBDBM285571
Synonyms:3-(4-chloro-3-fluorophenyl)-N-(2,2-difluorocyclopro-pyl)imidazo[1,2-b]pyridazine-2-carboxamide US10669279, Example 44 | US9598421, Example 44
TypeSmall organic molecule
Emp. Form.C16H10ClF3N4O
Mol. Mass.366.725
SMILESFc1cc(ccc1Cl)-c1c(nc2cccnn12)C(=O)NC1CC1(F)F