Reaction Details
TargetcAMP-specific 3',5'-cyclic phosphodiesterase 4A
LigandBDBM285573
Substrate/Competitorn/a
Meas. Tech.Scintillation Proximity Assay (SPA)
IC50 15.2±n/a nM
Citation Chappie, TAVerhoest, PRPatel, NCHayward, MMHelal, CJSciabola, SLaChapelle, EAYoung, JM Imidazopyridazine compounds US Patent US9598421 Publication Date 3/21/2017
 
cAMP-specific 3',5'-cyclic phosphodiesterase 4A
Name:cAMP-specific 3',5'-cyclic phosphodiesterase 4A
Type:Enzyme
Mol. Mass.:98113.27
Organism:Homo sapiens (Human)
Description:P27815
Residue:886
BDBM285573
NameBDBM285573
Synonyms:3-(4-chlorophenyl)-N-[(1R,2S)-2-fluorocyclopro-pyl]imidazo[1,2-b]pyridazine-2-carboxamide US10669279, Example 46 | US9598421, Example 46
TypeSmall organic molecule
Emp. Form.C16H12ClFN4O
Mol. Mass.330.744
SMILESF[C@H]1C[C@H]1NC(=O)c1nc2cccnn2c1-c1ccc(Cl)cc1