Reaction Details
TargetcAMP-specific 3',5'-cyclic phosphodiesterase 4C
LigandBDBM285576
Substrate/Competitorn/a
IC50 19.0±n/a nM
Citation Chappie, TAVerhoest, PRPatel, NCHayward, MMHelal, CJSciabola, SLaChapelle, EAYoung, JM Imidazopyridazine compounds US Patent US9598421 Publication Date 3/21/2017
 
cAMP-specific 3',5'-cyclic phosphodiesterase 4C
Name:cAMP-specific 3',5'-cyclic phosphodiesterase 4C
Type:Enzyme Catalytic Domain
Mol. Mass.:79875.54
Organism:Homo sapiens (Human)
Description:Q08493
Residue:712
BDBM285576
NameBDBM285576
Synonyms:US10077269, Example 49 US9598421, Example 49 | azetidin-1-yl[3-(3-chloro-4-methylphenyl)imidazo[1,2-b]pyridazin-2-yl]methanone
TypeSmall organic molecule
Emp. Form.C17H15ClN4O
Mol. Mass.326.78
SMILESCc1ccc(cc1Cl)-c1c(nc2cccnn12)C(=O)N1CCC1