Reaction Details
TargetcAMP-specific 3',5'-cyclic phosphodiesterase 4C
LigandBDBM285583
Substrate/Competitorn/a
IC50 84.5±n/a nM
Citation Chappie, TAVerhoest, PRPatel, NCHayward, MMHelal, CJSciabola, SLaChapelle, EAYoung, JM Imidazopyridazine compounds US Patent US9598421 Publication Date 3/21/2017
 
cAMP-specific 3',5'-cyclic phosphodiesterase 4C
Name:cAMP-specific 3',5'-cyclic phosphodiesterase 4C
Type:Enzyme Catalytic Domain
Mol. Mass.:79875.54
Organism:Homo sapiens (Human)
Description:Q08493
Residue:712
BDBM285583
NameBDBM285583
Synonyms:US10077269, Example 56 US9598421, Example 56 | azetidin-1-yl[3-(4-chloro-2-methylphenyl)imidazo[1,2-b]pyridazin-2-yl]methanone
TypeSmall organic molecule
Emp. Form.C17H15ClN4O
Mol. Mass.326.78
SMILESCc1cc(Cl)ccc1-c1c(nc2cccnn12)C(=O)N1CCC1