Reaction Details
TargetcAMP-specific 3',5'-cyclic phosphodiesterase 4D
LigandBDBM285597
Substrate/Competitorn/a
IC50 5760±n/a nM
Citation Chappie, TAVerhoest, PRPatel, NCHayward, MMHelal, CJSciabola, SLaChapelle, EAYoung, JM Imidazopyridazine compounds US Patent US9598421 Publication Date 3/21/2017
 
cAMP-specific 3',5'-cyclic phosphodiesterase 4D
Name:cAMP-specific 3',5'-cyclic phosphodiesterase 4D
Type:Protein
Mol. Mass.:91092.69
Organism:Homo sapiens (Human)
Description:Q08499
Residue:809
BDBM285597
NameBDBM285597
Synonyms:3-(4-chloro-2-methylphenyl)-N-[(1R,2S)-2-fluorocyclopro-pyl]imidazo[1,2-b]pyridazine-2-carboxamide US10669279, Example 70 | US9598421, Example 70
TypeSmall organic molecule
Emp. Form.C17H14ClFN4O
Mol. Mass.344.771
SMILESCc1cc(Cl)ccc1-c1c(nc2cccnn12)C(=O)N[C@@H]1C[C@@H]1F