Reaction Details
TargetcAMP-specific 3',5'-cyclic phosphodiesterase 4A
LigandBDBM285602
Substrate/Competitorn/a
Meas. Tech.Scintillation Proximity Assay (SPA)
IC50 10.5±n/a nM
Citation Chappie, TAVerhoest, PRPatel, NCHayward, MMHelal, CJSciabola, SLaChapelle, EAYoung, JM Imidazopyridazine compounds US Patent US9598421 Publication Date 3/21/2017
 
cAMP-specific 3',5'-cyclic phosphodiesterase 4A
Name:cAMP-specific 3',5'-cyclic phosphodiesterase 4A
Type:Enzyme
Mol. Mass.:98113.27
Organism:Homo sapiens (Human)
Description:P27815
Residue:886
BDBM285602
NameBDBM285602
Synonyms:N-cyclopropyl-3-[2-(difluoro-methoxy)pyridin-4-yl]imidazo[1,2-b]pyridazine-2-carboxamide US10669279, Example 75 | US9598421, Example 75
TypeSmall organic molecule
Emp. Form.C16H13F2N5O2
Mol. Mass.345.3035
SMILESFC(F)Oc1cc(ccn1)-c1c(nc2cccnn12)C(=O)NC1CC1