Reaction Details
TargetcAMP-specific 3',5'-cyclic phosphodiesterase 4A
LigandBDBM285613
Substrate/Competitorn/a
Meas. Tech.Scintillation Proximity Assay (SPA)
IC50 6.21±n/a nM
Citation Chappie, TAVerhoest, PRPatel, NCHayward, MMHelal, CJSciabola, SLaChapelle, EAYoung, JM Imidazopyridazine compounds US Patent US9598421 Publication Date 3/21/2017
 
cAMP-specific 3',5'-cyclic phosphodiesterase 4A
Name:cAMP-specific 3',5'-cyclic phosphodiesterase 4A
Type:Enzyme
Mol. Mass.:98113.27
Organism:Homo sapiens (Human)
Description:P27815
Residue:886
BDBM285613
NameBDBM285613
Synonyms:US10077269, Example 83 US9598421, Example 83 | azetidin-1-yl[3-(3,4-dichloro-phenyl)imidazo[1,2-b]pyridazin-2-yl]methanone
TypeSmall organic molecule
Emp. Form.C16H12Cl2N4O
Mol. Mass.347.199
SMILESClc1ccc(cc1Cl)-c1c(nc2cccnn12)C(=O)N1CCC1