Reaction Details
TargetcAMP-specific 3',5'-cyclic phosphodiesterase 4B
LigandBDBM285615
Substrate/Competitorn/a
IC50 87.3±n/a nM
Citation Chappie, TAVerhoest, PRPatel, NCHayward, MMHelal, CJSciabola, SLaChapelle, EAYoung, JM Imidazopyridazine compounds US Patent US9598421 Publication Date 3/21/2017
 
cAMP-specific 3',5'-cyclic phosphodiesterase 4B
Name:cAMP-specific 3',5'-cyclic phosphodiesterase 4B
Type:Protein
Mol. Mass.:83318.87
Organism:Homo sapiens (Human)
Description:Q07343
Residue:736
BDBM285615
NameBDBM285615
Synonyms:3-(4-chlorophenyl)-N-ethylimidazo[1,2-b]pyridazine-2-carboxamide US10669279, Example 85 | US9598421, Example 85
TypeSmall organic molecule
Emp. Form.C15H13ClN4O
Mol. Mass.300.743
SMILESCCNC(=O)c1nc2cccnn2c1-c1ccc(Cl)cc1