Reaction Details
TargetcAMP-specific 3',5'-cyclic phosphodiesterase 4A
LigandBDBM285616
Substrate/Competitorn/a
Meas. Tech.Scintillation Proximity Assay (SPA)
IC50 5.83±n/a nM
Citation Chappie, TAVerhoest, PRPatel, NCHayward, MMHelal, CJSciabola, SLaChapelle, EAYoung, JM Imidazopyridazine compounds US Patent US9598421 Publication Date 3/21/2017
 
cAMP-specific 3',5'-cyclic phosphodiesterase 4A
Name:cAMP-specific 3',5'-cyclic phosphodiesterase 4A
Type:Enzyme
Mol. Mass.:98113.27
Organism:Homo sapiens (Human)
Description:P27815
Residue:886
BDBM285616
NameBDBM285616
Synonyms:US10077269, Example 86 US9598421, Example 86 | azetidin-1-yl[3-(2,2-difluoro-1,3-benzodioxol-5-yl)imidazo[1,2-b]pyridazin-2-yl]methanone
TypeSmall organic molecule
Emp. Form.C17H12F2N4O3
Mol. Mass.358.299
SMILESFC1(F)Oc2ccc(cc2O1)-c1c(nc2cccnn12)C(=O)N1CCC1