Reaction Details
TargetcAMP-specific 3',5'-cyclic phosphodiesterase 4A
LigandBDBM285624
Substrate/Competitorn/a
Meas. Tech.Scintillation Proximity Assay (SPA)
IC50 24.9±n/a nM
Citation Chappie, TAVerhoest, PRPatel, NCHayward, MMHelal, CJSciabola, SLaChapelle, EAYoung, JM Imidazopyridazine compounds US Patent US9598421 Publication Date 3/21/2017
 
cAMP-specific 3',5'-cyclic phosphodiesterase 4A
Name:cAMP-specific 3',5'-cyclic phosphodiesterase 4A
Type:Enzyme
Mol. Mass.:98113.27
Organism:Homo sapiens (Human)
Description:P27815
Residue:886
BDBM285624
NameBDBM285624
Synonyms:3-(4-chloro-3-fluorophenyl)-N-methylimidazo[1,2-b]pyridazine-2-carboxamide US10669279, Example 94 | US9598421, Example 94
TypeSmall organic molecule
Emp. Form.C14H10ClFN4O
Mol. Mass.304.707
SMILESCNC(=O)c1nc2cccnn2c1-c1ccc(Cl)c(F)c1