Reaction Details
TargetcAMP-specific 3',5'-cyclic phosphodiesterase 4A
LigandBDBM285634
Substrate/Competitorn/a
Meas. Tech.Scintillation Proximity Assay (SPA)
IC50<0.488±n/a nM
Citation Chappie, TAVerhoest, PRPatel, NCHayward, MMHelal, CJSciabola, SLaChapelle, EAYoung, JM Imidazopyridazine compounds US Patent US9598421 Publication Date 3/21/2017
 
cAMP-specific 3',5'-cyclic phosphodiesterase 4A
Name:cAMP-specific 3',5'-cyclic phosphodiesterase 4A
Type:Enzyme
Mol. Mass.:98113.27
Organism:Homo sapiens (Human)
Description:P27815
Residue:886
BDBM285634
NameBDBM285634
Synonyms:3-(4-chloro-3,5-difluoro-phenyl)-N-cyclopropyl-imidazo[1,2-b]pyridazine-2-carboxamide US10669279, Example 104 | US9598421, Example 104
TypeSmall organic molecule
Emp. Form.C16H11ClF2N4O
Mol. Mass.348.735
SMILESFc1cc(cc(F)c1Cl)-c1c(nc2cccnn12)C(=O)NC1CC1