Reaction Details
TargetCasein kinase I isoform delta
LigandBDBM302444
Substrate/Competitorn/a
Meas. Tech.Kinase Assay
IC50<10±n/a nM
Citation Velaparthi, UDarne, CPLiu, PWittman, MDPearce, BCAraujo, EMDasgupta, BNair, JSJanakiraman, SKRachamreddy, CRMettu, MRKaruppiah, AMReddy, BSNagalakshmi, PBora, ROMaheshwarappa, SHKumaravel, SMullick, DSistla, R Substituted 4,5,6,7-tetrahydropyrazolo[1,5-A]pyrazine derivatives as casein kinase 1 D/E inhibitors US Patent US9598423 Publication Date 3/21/2017
 
Casein kinase I isoform delta
Name:Casein kinase I isoform delta
Type:Enzyme
Mol. Mass.:47356.76
Organism:Homo sapiens (Human)
Description:P48730
Residue:415
BDBM302444
NameBDBM302444
Synonyms:N5-(4-Chlorophenyl)-2- (3-fluorophenyl)-6,7- dihydropyrazolo[1,5-a] pyrazine-3,5(4H)- dicarboxamide | US9598423, Example 10
TypeSmall organic molecule
Emp. Form.C20H17ClFN5O2
Mol. Mass.413.833
SMILESNC(=O)c1c2CN(CCn2nc1-c1cccc(F)c1)C(=O)Nc1ccc(Cl)cc1