Reaction Details
TargetReplicase polyprotein 1ab
LigandBDBM512416
Substrate/Competitorn/a
Meas. Tech.Various Assay
IC50 17±n/a nM
Citation Gao, KWang, RChen, JTepe, JJHuang, FWei, GW Perspectives on SARS-CoV-2 Main Protease Inhibitors. J Med Chem64:16922-16955 (2021) 
 
Replicase polyprotein 1ab
Name:Replicase polyprotein 1ab
Type:Protein
Mol. Mass.:790250.81
Organism:Human SARS coronavirus (SARS-CoV) (Severe acute respiratory syndrome coronavirus)
Description:P0C6X7
Residue:7073
BDBM512416
NameBDBM512416
Synonyms:acs.jmedchem.1c00409_ST.13
TypeSmall Organic Molecule
Emp. Form.C32H35N5O7
Mol. Mass.601.6496
SMILESCOc1cccc2[nH]c(cc12)C(=O)NC(CC(C)C)C(=O)NC(CC1CCNC1=O)C(=O)COC(=O)c1ccccc1C#N