Reaction Details
TargetReplicase polyprotein 1ab
LigandBDBM512420
Substrate/Competitorn/a
Meas. Tech.Various Assay
IC50 20±n/a nM
Citation Gao, KWang, RChen, JTepe, JJHuang, FWei, GW Perspectives on SARS-CoV-2 Main Protease Inhibitors. J Med Chem64:16922-16955 (2021) 
 
Replicase polyprotein 1ab
Name:Replicase polyprotein 1ab
Type:Protein
Mol. Mass.:790250.81
Organism:Human SARS coronavirus (SARS-CoV) (Severe acute respiratory syndrome coronavirus)
Description:P0C6X7
Residue:7073
BDBM512420
NameBDBM512420
Synonyms:acs.jmedchem.1c00409_ST.17
TypeSmall Organic Molecule
Emp. Form.C24H32N4O5
Mol. Mass.456.5347
SMILESCC(C)(C)CC(NC(=O)c1cc2ccccc2[nH]1)C(=O)NC(CC1CCNC1=O)C(=O)CO