Reaction Details
TargetReplicase polyprotein 1ab
LigandBDBM429304
Substrate/Competitorn/a
Meas. Tech.Various Assay
IC50 30±n/a nM
Citation Gao, KWang, RChen, JTepe, JJHuang, FWei, GW Perspectives on SARS-CoV-2 Main Protease Inhibitors. J Med Chem64:16922-16955 (2021) 
 
Replicase polyprotein 1ab
Name:Replicase polyprotein 1ab
Type:Protein
Mol. Mass.:790250.81
Organism:Human SARS coronavirus (SARS-CoV) (Severe acute respiratory syndrome coronavirus)
Description:P0C6X7
Residue:7073
BDBM429304
NameBDBM429304
Synonyms:CVD-0006354 indole chloropyridinyl-ester derived, 1 | jm5b01461, Compound 124
TypeSmall Organic Molecule
Emp. Form.C14H9ClN2O2
Mol. Mass.272.686
SMILESClc1cncc(OC(=O)c2cccc3[nH]ccc23)c1