Reaction Details
TargetReplicase polyprotein 1ab
LigandBDBM512439
Substrate/Competitorn/a
Meas. Tech.Various Assay
IC50 44±n/a nM
Citation Gao, KWang, RChen, JTepe, JJHuang, FWei, GW Perspectives on SARS-CoV-2 Main Protease Inhibitors. J Med Chem64:16922-16955 (2021) 
 
Replicase polyprotein 1ab
Name:Replicase polyprotein 1ab
Type:Protein
Mol. Mass.:790250.81
Organism:Human SARS coronavirus (SARS-CoV) (Severe acute respiratory syndrome coronavirus)
Description:P0C6X7
Residue:7073
BDBM512439
NameBDBM512439
Synonyms:acs.jmedchem.1c00409_ST.32
TypeSmall Organic Molecule
Emp. Form.C27H36N4O6
Mol. Mass.512.5979
SMILESCOc1cccc2[nH]c(cc12)C(=O)NC(CC1CCCCC1)C(=O)NC(CC1CCNC1=O)C(=O)CO