Reaction Details
TargetReplicase polyprotein 1ab
LigandBDBM50208940
Substrate/Competitorn/a
Meas. Tech.Various Assay
IC50 50±n/a nM
Citation Gao, KWang, RChen, JTepe, JJHuang, FWei, GW Perspectives on SARS-CoV-2 Main Protease Inhibitors. J Med Chem64:16922-16955 (2021) 
 
Replicase polyprotein 1ab
Name:Replicase polyprotein 1ab
Type:Protein
Mol. Mass.:790250.81
Organism:Human SARS coronavirus (SARS-CoV) (Severe acute respiratory syndrome coronavirus)
Description:P0C6X7
Residue:7073
BDBM50208940
NameBDBM50208940
Synonyms:5-bromo-pyridin-3-yl furan-2-carboxylate CHEMBL222234 jm5b01461, Compound 121
TypeSmall organic molecule
Emp. Form.C10H6BrNO3
Mol. Mass.268.064
SMILESBrc1cncc(OC(=O)c2ccco2)c1