Reaction Details
TargetReplicase polyprotein 1ab
LigandBDBM512486
Substrate/Competitorn/a
Meas. Tech.Various Assay
IC50 50±n/a nM
Citation Gao, KWang, RChen, JTepe, JJHuang, FWei, GW Perspectives on SARS-CoV-2 Main Protease Inhibitors. J Med Chem64:16922-16955 (2021) 
 
Replicase polyprotein 1ab
Name:Replicase polyprotein 1ab
Type:Protein
Mol. Mass.:790250.81
Organism:Human SARS coronavirus (SARS-CoV) (Severe acute respiratory syndrome coronavirus)
Description:P0C6X7
Residue:7073
BDBM512486
NameBDBM512486
Synonyms:GC376\\(NC(=O)OCc1
TypeSmall Organic Molecule
Emp. Form.C21H31N3O8S
Mol. Mass.485.551
SMILESCC(C)C[C@H](NC(=O)OCc1ccccc1)C(=O)N[C@@H](C[C@@H]1CCNC1=O)[C@@H](O)S(O)(=O)=O