Reaction Details
TargetTyrosine-protein kinase JAK2
LigandBDBM173935
Substrate/Competitorn/a
Meas. Tech.JAK2 Kinase Assay
IC50 4.00±n/a nM
Citation Brasca, MGBindi, SCaldarelli, MNesi, MOrrenius, SCPanzeri, A Substituted pyrroles active as kinases inhibitors US Patent US9688661 Publication Date 6/27/2017
 
Tyrosine-protein kinase JAK2
Name:Tyrosine-protein kinase JAK2
Type:Protein
Mol. Mass.:130684.68
Organism:Homo sapiens (Human)
Description:O60674
Residue:1132
BDBM173935
NameBDBM173935
Synonyms:US9688661, 1-(5-Chloro-2-methylphenyl)-4-(7H-pyrrolo[2,3-d]pyrimidin-4-yl)-1H-pyrrole-2-carbonitrile (compd 63)
TypeSmall organic molecule
Emp. Form.C18H12ClN5
Mol. Mass.333.774
SMILESCc1ccc(Cl)cc1-n1cc(cc1C#N)-c1ncnc2[nH]ccc12