Reaction Details
TargetTyrosine-protein kinase JAK1 [861-1152]
LigandBDBM173937
Substrate/Competitorn/a
Meas. Tech.JAK1 Kinase Assay
IC50 17±n/a nM
Citation Brasca, MGBindi, SCaldarelli, MNesi, MOrrenius, SCPanzeri, A Substituted pyrroles active as kinases inhibitors US Patent US9688661 Publication Date 6/27/2017
 
Tyrosine-protein kinase JAK1 [861-1152]
Name:Tyrosine-protein kinase JAK1 [861-1152]
Type:Protein
Mol. Mass.:33439.94
Organism:Homo sapiens (Human)
Description:Human JAK1 variant (861-1152 aa)
Residue:292
BDBM173937
NameBDBM173937
Synonyms:US9688661, 1-[2-Chloro-5-(trifluoromethyl)phenyl]-4-(7H-pyrrolo[2,3-d]pyrimidin-4-yl)-1H-pyrrole-2-carbonitrile (compd 72)
TypeSmall organic molecule
Emp. Form.C16H12ClN5
Mol. Mass.309.753
SMILESCc1ccc(Cl)cc1-c1cn(cc1C#N)-c1cc(N)ncn1