Reaction Details
TargetTyrosine-protein kinase JAK2
LigandBDBM173984
Substrate/Competitorn/a
Meas. Tech.JAK2 Kinase Assay
IC50 2.00±n/a nM
Citation Brasca, MGBindi, SCaldarelli, MNesi, MOrrenius, SCPanzeri, A Substituted pyrroles active as kinases inhibitors US Patent US9688661 Publication Date 6/27/2017
 
Tyrosine-protein kinase JAK2
Name:Tyrosine-protein kinase JAK2
Type:Protein
Mol. Mass.:130684.68
Organism:Homo sapiens (Human)
Description:O60674
Residue:1132
BDBM173984
NameBDBM173984
Synonyms:US9688661, 2-(5-Chloro-2-ethylphenyl)-5-[6-(methylamino)pyrimidin-4-yl]-1H-pyrrole-3-carboxamide (compd 198) | US9688661, 2-(5-Chloro-2-methylphenyl)-5-[6-(methylamino)pyrimidin-4-yl]-1H-pyrrole-3-carboxamide (compd 190)
TypeSmall organic molecule
Emp. Form.C17H15ClN5O
Mol. Mass.340.787
SMILESCNc1cc(ncn1)-c1cc(C(N)=O)c(n1)-c1cc(Cl)ccc1C